- Jun 6, 2020
- 11,559
- 4,422
Hello Please Help, after Step by Step Update I cannot Run in debug or Release mode, the log shows the following message:
Thaks in advance!
[IDE message - 4:56:47]
Ha ocurrido un error.
Error: Cannot fit requested classes in a single dex file (# methods: 68439 > 65536). Try supplying a main-dex list
Compilation failed
Exception in thread "main" java.lang.RuntimeException: com.android.tools.r8.CompilationFailedException: Compilation failed to complete, position: null
at com.android.tools.r8.internal.vj.a(R8_3.3.20-dev+aosp1_dd4c01853fd917497aef2d09abff533f0d25b062517ea74449d40e1778a34753:98)
at com.android.tools.r8.D8.main(R8_3.3.20-dev+aosp1_dd4c01853fd917497aef2d09abff533f0d25b062517ea74449d40e1778a34753:4)
Caused by: com.android.tools.r8.CompilationFailedException: Compilation failed to complete, position: null
at Version.fakeStackEntry(Version_3.3.20-dev+aosp1.java:0)
at...
Thaks in advance!
[IDE message - 4:56:47]
Ha ocurrido un error.
Error: Cannot fit requested classes in a single dex file (# methods: 68439 > 65536). Try supplying a main-dex list
Compilation failed
Exception in thread "main" java.lang.RuntimeException: com.android.tools.r8.CompilationFailedException: Compilation failed to complete, position: null
at com.android.tools.r8.internal.vj.a(R8_3.3.20-dev+aosp1_dd4c01853fd917497aef2d09abff533f0d25b062517ea74449d40e1778a34753:98)
at com.android.tools.r8.D8.main(R8_3.3.20-dev+aosp1_dd4c01853fd917497aef2d09abff533f0d25b062517ea74449d40e1778a34753:4)
Caused by: com.android.tools.r8.CompilationFailedException: Compilation failed to complete, position: null
at Version.fakeStackEntry(Version_3.3.20-dev+aosp1.java:0)
at...
برای دیدن لینک ها باید ثبت نام کنید
برای دیدن لینک ها باید ثبت نام کنید